{"text_format":"1","workbook":"xlsx","n_sheets":2,"sheets":["Tabelle1","Tabelle2"],"not_rendered":{"charts":0,"images":0,"macros":1,"external_links":0,"defined_names":3,"comments":2,"pivot_tables":0},"unopened":[],"bounds":{"document_bytes":16777216,"sheet_cells":100000,"rows_first":2000,"rows_last":500,"rows_between":2000,"halvings":0,"cell_chars":16384,"cell_head_chars":4096},"cells_cut":0,"cells_raw":0,"read":"whole","date_system":"1900"}

{"sheet":"Tabelle1","index":0,"n_rows":230,"n_cols":33,"rows_kept":230,"cut":false,"hidden":false,"merged":[]}
["Volkssportläufe im Saalekreis im Jahre",null,null,null,null,null,2023]
["Wertungstabelle  Kreisranglistenläufe "]
[]
["Laufwertungen und Plazierungen"]
["sex","AK","Pl.","Name","Jahr-gang","Verein ","Final-Wert","Teil-nahmen","Läufe in Wertung","Punkte","1.","2.","3.","4.","5.","6.","7.","8.","9.","10.","11.","12.",null,null,null,null,null,null,null,null,null,null,"Streich-werte"]
["W",{"$f":"IF(ISBLANK(E6),\"\",LOOKUP(IF(2000+E6>$G$1,1900+E6,2000+E6),Tabelle2!A:A,Tabelle2!C:C))","v":"U12"},{"$f":"IF(G6>=1,SUMPRODUCT(($A$6:$A$418=A6)*($B$6:$B$418=B6)*($G$6:$G$418>G6))+1,\"\")","v":1},"Wagner, Anny",12,"TSV Leuna Ski",{"$f":"H6+J6","v":26},{"$f":"COUNTIF(K6:AE6,\">=1\")+COUNTIF(K6:AE6,\"T\")","v":1},{"$f":"MIN(15,COUNTIF(K6:AE6,\">=1\"))","v":1},{"$f":"IF(I6>=15,(SUM(LARGE(K6:AE6,{1;2;3;4;5;6;7;8;9;10;11;12;13;14;15}))+AF6),SUM(K6:AF6))","v":25},null,25,null,null,null,null,null,null,null,null,null,null,null,null,null,null,null,null,null,null,null,null,{"$f":"COUNTIF(K6:AF6,\">=1\")-I6","v":0}]
["W",{"$f":"IF(ISBLANK(E7),\"\",LOOKUP(IF(2000+E7>$G$1,1900+E7,2000+E7),Tabelle2!A:A,Tabelle2!C:C))","v":"U12"},{"$f":"IF(G7>=1,SUMPRODUCT(($A$6:$A$418=A7)*($B$6:$B$418=B7)*($G$6:$G$418>G7))+1,\"\")","v":1},"Wagner, Magdalena",13,"TSV Leuna Ski",{"$f":"H7+J7","v":26},{"$f":"COUNTIF(K7:AE7,\">=1\")+COUNTIF(K7:AE7,\"T\")","v":1},{"$f":"MIN(15,COUNTIF(K7:AE7,\">=1\"))","v":1},{"$f":"IF(I7>=15,(SUM(LARGE(K7:AE7,{1;2;3;4;5;6;7;8;9;10;11;12;13;14;15}))+AF7),SUM(K7:AF7))","v":25},null,25,null,null,null,null,null,null,null,null,null,null,null,null,null,null,null,null,null,null,null,null,{"$f":"COUNTIF(K7:AF7,\">=1\")-I7","v":0}]
["W",{"$f":"IF(ISBLANK(E8),\"\",LOOKUP(IF(2000+E8>$G$1,1900+E8,2000+E8),Tabelle2!A:A,Tabelle2!C:C))","v":"U14"},{"$f":"IF(G8>=1,SUMPRODUCT(($A$6:$A$418=A8)*($B$6:$B$418=B8)*($G$6:$G$418>G8))+1,\"\")","v":1},"Ballhaus, Clara",11,"TSV Leuna",{"$f":"H8+J8","v":52},{"$f":"COUNTIF(K8:AE8,\">=1\")+COUNTIF(K8:AE8,\"T\")","v":2},{"$f":"MIN(15,COUNTIF(K8:AE8,\">=1\"))","v":2},{"$f":"IF(I8>=15,(SUM(LARGE(K8:AE8,{1;2;3;4;5;6;7;8;9;10;11;12;13;14;15}))+AF8),SUM(K8:AF8))","v":50},25,25,null,null,null,null,null,null,null,null,null,null,null,null,null,null,null,null,null,null,null,null,{"$f":"COUNTIF(K8:AF8,\">=1\")-I8","v":0}]
["W",{"$f":"IF(ISBLANK(E9),\"\",LOOKUP(IF(2000+E9>$G$1,1900+E9,2000+E9),Tabelle2!A:A,Tabelle2!C:C))","v":"U14"},{"$f":"IF(G9>=1,SUMPRODUCT(($A$6:$A$418=A9)*($B$6:$B$418=B9)*($G$6:$G$418>G9))+1,\"\")","v":2},"Lange, Lilli",10,"TSV Leuna Ski",{"$f":"H9+J9","v":24},{"$f":"COUNTIF(K9:AE9,\">=1\")+COUNTIF(K9:AE9,\"T\")","v":1},{"$f":"MIN(15,COUNTIF(K9:AE9,\">=1\"))","v":1},{"$f":"IF(I9>=15,(SUM(LARGE(K9:AE9,{1;2;3;4;5;6;7;8;9;10;11;12;13;14;15}))+AF9),SUM(K9:AF9))","v":23},null,23,null,null,null,null,null,null,null,null,null,null,null,null,null,null,null,null,null,null,null,null,{"$f":"COUNTIF(K9:AF9,\">=1\")-I9","v":0}]
["W",{"$f":"IF(ISBLANK(E10),\"\",LOOKUP(IF(2000+E10>$G$1,1900+E10,2000+E10),Tabelle2!A:A,Tabelle2!C:C))","v":"U14"},{"$f":"IF(G10>=1,SUMPRODUCT(($A$6:$A$418=A10)*($B$6:$B$418=B10)*($G$6:$G$418>G10))+1,\"\")","v":""},"Brammertz, Laura",10,"SV Braunsbedra",{"$f":"H10+J10","v":0},{"$f":"COUNTIF(K10:AE10,\">=1\")+COUNTIF(K10:AE10,\"T\")","v":0},{"$f":"MIN(15,COUNTIF(K10:AE10,\">=1\"))","v":0},{"$f":"IF(I10>=15,(SUM(LARGE(K10:AE10,{1;2;3;4;5;6;7;8;9;10;11;12;13;14;15}))+AF10),SUM(K10:AF10))","v":0},null,null,null,null,null,null,null,null,null,null,null,null,null,null,null,null,null,null,null,null,null,null,{"$f":"COUNTIF(K10:AF10,\">=1\")-I10","v":0}]
["W",{"$f":"IF(ISBLANK(E11),\"\",LOOKUP(IF(2000+E11>$G$1,1900+E11,2000+E11),Tabelle2!A:A,Tabelle2!C:C))","v":"U14"},{"$f":"IF(G11>=1,SUMPRODUCT(($A$6:$A$418=A11)*($B$6:$B$418=B11)*($G$6:$G$418>G11))+1,\"\")","v":""},"Witzsche, Yasmin",10,"TSV Leuna Ski",{"$f":"H11+J11","v":0},{"$f":"COUNTIF(K11:AE11,\">=1\")+COUNTIF(K11:AE11,\"T\")","v":0},{"$f":"MIN(15,COUNTIF(K11:AE11,\">=1\"))","v":0},{"$f":"IF(I11>=15,(SUM(LARGE(K11:AE11,{1;2;3;4;5;6;7;8;9;10;11;12;13;14;15}))+AF11),SUM(K11:AF11))","v":0},null,null,null,null,null,null,null,null,null,null,null,null,null,null,null,null,null,null,null,null,null,null,{"$f":"COUNTIF(K11:AF11,\">=1\")-I11","v":0}]
["W",{"$f":"IF(ISBLANK(E12),\"\",LOOKUP(IF(2000+E12>$G$1,1900+E12,2000+E12),Tabelle2!A:A,Tabelle2!C:C))","v":"U14"},{"$f":"IF(G12>=1,SUMPRODUCT(($A$6:$A$418=A12)*($B$6:$B$418=B12)*($G$6:$G$418>G12))+1,\"\")","v":""},"Zentrich, Luise",10,"SV Braunsbedra",{"$f":"H12+J12","v":0},{"$f":"COUNTIF(K12:AE12,\">=1\")+COUNTIF(K12:AE12,\"T\")","v":0},{"$f":"MIN(15,COUNTIF(K12:AE12,\">=1\"))","v":0},{"$f":"IF(I12>=15,(SUM(LARGE(K12:AE12,{1;2;3;4;5;6;7;8;9;10;11;12;13;14;15}))+AF12),SUM(K12:AF12))","v":0},null,null,null,null,null,null,null,null,null,null,null,null,null,null,null,null,null,null,null,null,null,null,{"$f":"COUNTIF(K12:AF12,\">=1\")-I12","v":0}]
["W",{"$f":"IF(ISBLANK(E13),\"\",LOOKUP(IF(2000+E13>$G$1,1900+E13,2000+E13),Tabelle2!A:A,Tabelle2!C:C))","v":"U16"},{"$f":"IF(G13>=1,SUMPRODUCT(($A$6:$A$418=A13)*($B$6:$B$418=B13)*($G$6:$G$418>G13))+1,\"\")","v":1},"Becker, Pia-Marie",9,"SV Braunsbedra",{"$f":"H13+J13","v":52},{"$f":"COUNTIF(K13:AE13,\">=1\")+COUNTIF(K13:AE13,\"T\")","v":2},{"$f":"MIN(15,COUNTIF(K13:AE13,\">=1\"))","v":2},{"$f":"IF(I13>=15,(SUM(LARGE(K13:AE13,{1;2;3;4;5;6;7;8;9;10;11;12;13;14;15}))+AF13),SUM(K13:AF13))","v":50},25,25,null,null,null,null,null,null,null,null,null,null,null,null,null,null,null,null,null,null,null,null,{"$f":"COUNTIF(K13:AF13,\">=1\")-I13","v":0}]
["W",{"$f":"IF(ISBLANK(E14),\"\",LOOKUP(IF(2000+E14>$G$1,1900+E14,2000+E14),Tabelle2!A:A,Tabelle2!C:C))","v":"U16"},{"$f":"IF(G14>=1,SUMPRODUCT(($A$6:$A$418=A14)*($B$6:$B$418=B14)*($G$6:$G$418>G14))+1,\"\")","v":2},"Hauptrock, Judy",9,"TSV Leuna Ski",{"$f":"H14+J14","v":26},{"$f":"COUNTIF(K14:AE14,\">=1\")+COUNTIF(K14:AE14,\"T\")","v":1},{"$f":"MIN(15,COUNTIF(K14:AE14,\">=1\"))","v":1},{"$f":"IF(I14>=15,(SUM(LARGE(K14:AE14,{1;2;3;4;5;6;7;8;9;10;11;12;13;14;15}))+AF14),SUM(K14:AF14))","v":25},null,25,null,null,null,null,null,null,null,null,null,null,null,null,null,null,null,null,null,null,null,null,{"$f":"COUNTIF(K14:AF14,\">=1\")-I14","v":0}]
["W",{"$f":"IF(ISBLANK(E15),\"\",LOOKUP(IF(2000+E15>$G$1,1900+E15,2000+E15),Tabelle2!A:A,Tabelle2!C:C))","v":"U16"},{"$f":"IF(G15>=1,SUMPRODUCT(($A$6:$A$418=A15)*($B$6:$B$418=B15)*($G$6:$G$418>G15))+1,\"\")","v":""},"Dittrich, Johanna",8,"WHV 91",{"$f":"H15+J15","v":0},{"$f":"COUNTIF(K15:AE15,\">=1\")+COUNTIF(K15:AE15,\"T\")","v":0},{"$f":"MIN(15,COUNTIF(K15:AE15,\">=1\"))","v":0},{"$f":"IF(I15>=15,(SUM(LARGE(K15:AE15,{1;2;3;4;5;6;7;8;9;10;11;12;13;14;15}))+AF15),SUM(K15:AF15))","v":0},null,null,null,null,null,null,null,null,null,null,null,null,null,null,null,null,null,null,null,null,null,null,{"$f":"COUNTIF(K15:AF15,\">=1\")-I15","v":0}]
["W",{"$f":"IF(ISBLANK(E16),\"\",LOOKUP(IF(2000+E16>$G$1,1900+E16,2000+E16),Tabelle2!A:A,Tabelle2!C:C))","v":"U16"},{"$f":"IF(G16>=1,SUMPRODUCT(($A$6:$A$418=A16)*($B$6:$B$418=B16)*($G$6:$G$418>G16))+1,\"\")","v":""},"Hähnel, Allega",8,"TSV Leuna Ski",{"$f":"H16+J16","v":0},{"$f":"COUNTIF(K16:AE16,\">=1\")+COUNTIF(K16:AE16,\"T\")","v":0},{"$f":"MIN(15,COUNTIF(K16:AE16,\">=1\"))","v":0},{"$f":"IF(I16>=15,(SUM(LARGE(K16:AE16,{1;2;3;4;5;6;7;8;9;10;11;12;13;14;15}))+AF16),SUM(K16:AF16))","v":0},null,null,null,null,null,null,null,null,null,null,null,null,null,null,null,null,null,null,null,null,null,null,{"$f":"COUNTIF(K16:AF16,\">=1\")-I16","v":0}]
["W",{"$f":"IF(ISBLANK(E17),\"\",LOOKUP(IF(2000+E17>$G$1,1900+E17,2000+E17),Tabelle2!A:A,Tabelle2!C:C))","v":"U18"},{"$f":"IF(G17>=1,SUMPRODUCT(($A$6:$A$418=A17)*($B$6:$B$418=B17)*($G$6:$G$418>G17))+1,\"\")","v":1},"Liebscher, Julia",7,"SV Braunsbedra",{"$f":"H17+J17","v":26},{"$f":"COUNTIF(K17:AE17,\">=1\")+COUNTIF(K17:AE17,\"T\")","v":1},{"$f":"MIN(15,COUNTIF(K17:AE17,\">=1\"))","v":1},{"$f":"IF(I17>=15,(SUM(LARGE(K17:AE17,{1;2;3;4;5;6;7;8;9;10;11;12;13;14;15}))+AF17),SUM(K17:AF17))","v":25},null,25,null,null,null,null,null,null,null,null,null,null,null,null,null,null,null,null,null,null,null,null,{"$f":"COUNTIF(K17:AF17,\">=1\")-I17","v":0}]
["W",{"$f":"IF(ISBLANK(E18),\"\",LOOKUP(IF(2000+E18>$G$1,1900+E18,2000+E18),Tabelle2!A:A,Tabelle2!C:C))","v":"U18"},{"$f":"IF(G18>=1,SUMPRODUCT(($A$6:$A$418=A18)*($B$6:$B$418=B18)*($G$6:$G$418>G18))+1,\"\")","v":""},"Hassenmeier, Maren",7,"SV Brajunsbedra",{"$f":"H18+J18","v":0},{"$f":"COUNTIF(K18:AE18,\">=1\")+COUNTIF(K18:AE18,\"T\")","v":0},{"$f":"MIN(15,COUNTIF(K18:AE18,\">=1\"))","v":0},{"$f":"IF(I18>=15,(SUM(LARGE(K18:AE18,{1;2;3;4;5;6;7;8;9;10;11;12;13;14;15}))+AF18),SUM(K18:AF18))","v":0},null,null,null,null,null,null,null,null,null,null,null,null,null,null,null,null,null,null,null,null,null,null,{"$f":"COUNTIF(K18:AF18,\">=1\")-I18","v":0}]
["W",{"$f":"IF(ISBLANK(E19),\"\",LOOKUP(IF(2000+E19>$G$1,1900+E19,2000+E19),Tabelle2!A:A,Tabelle2!C:C))","v":"U20"},{"$f":"IF(G19>=1,SUMPRODUCT(($A$6:$A$418=A19)*($B$6:$B$418=B19)*($G$6:$G$418>G19))+1,\"\")","v":1},"Krebs, Carolin ",4,"Gutenberg",{"$f":"H19+J19","v":26},{"$f":"COUNTIF(K19:AE19,\">=1\")+COUNTIF(K19:AE19,\"T\")","v":1},{"$f":"MIN(15,COUNTIF(K19:AE19,\">=1\"))","v":1},{"$f":"IF(I19>=15,(SUM(LARGE(K19:AE19,{1;2;3;4;5;6;7;8;9;10;11;12;13;14;15}))+AF19),SUM(K19:AF19))","v":25},null,25,null,null,null,null,null,null,null,null,null,null,null,null,null,null,null,null,null,null,null,null,{"$f":"COUNTIF(K19:AF19,\">=1\")-I19","v":0}]
["W",{"$f":"IF(ISBLANK(E20),\"\",LOOKUP(IF(2000+E20>$G$1,1900+E20,2000+E20),Tabelle2!A:A,Tabelle2!C:C))","v":20},{"$f":"IF(G20>=1,SUMPRODUCT(($A$6:$A$418=A20)*($B$6:$B$418=B20)*($G$6:$G$418>G20))+1,\"\")","v":""},"Krakowiak, Laura",96,"Mücheln",{"$f":"H20+J20","v":0},{"$f":"COUNTIF(K20:AE20,\">=1\")+COUNTIF(K20:AE20,\"T\")","v":0},{"$f":"MIN(15,COUNTIF(K20:AE20,\">=1\"))","v":0},{"$f":"IF(I20>=15,(SUM(LARGE(K20:AE20,{1;2;3;4;5;6;7;8;9;10;11;12;13;14;15}))+AF20),SUM(K20:AF20))","v":0},null,null,null,null,null,null,null,null,null,null,null,null,null,null,null,null,null,null,null,null,null,null,{"$f":"COUNTIF(K20:AF20,\">=1\")-I20","v":0}]
["W",{"$f":"IF(ISBLANK(E21),\"\",LOOKUP(IF(2000+E21>$G$1,1900+E21,2000+E21),Tabelle2!A:A,Tabelle2!C:C))","v":20},{"$f":"IF(G21>=1,SUMPRODUCT(($A$6:$A$418=A21)*($B$6:$B$418=B21)*($G$6:$G$418>G21))+1,\"\")","v":""},"Schier, Maria",3,"Braunsbedra",{"$f":"H21+J21","v":0},{"$f":"COUNTIF(K21:AE21,\">=1\")+COUNTIF(K21:AE21,\"T\")","v":0},{"$f":"MIN(15,COUNTIF(K21:AE21,\">=1\"))","v":0},{"$f":"IF(I21>=15,(SUM(LARGE(K21:AE21,{1;2;3;4;5;6;7;8;9;10;11;12;13;14;15}))+AF21),SUM(K21:AF21))","v":0},null,null,null,null,null,null,null,null,null,null,null,null,null,null,null,null,null,null,null,null,null,null,{"$f":"COUNTIF(K21:AF21,\">=1\")-I21","v":0}]
["W",{"$f":"IF(ISBLANK(E22),\"\",LOOKUP(IF(2000+E22>$G$1,1900+E22,2000+E22),Tabelle2!A:A,Tabelle2!C:C))","v":20},{"$f":"IF(G22>=1,SUMPRODUCT(($A$6:$A$418=A22)*($B$6:$B$418=B22)*($G$6:$G$418>G22))+1,\"\")","v":""},"Walther, Carolin",94,"Mücheln",{"$f":"H22+J22","v":0},{"$f":"COUNTIF(K22:AE22,\">=1\")+COUNTIF(K22:AE22,\"T\")","v":0},{"$f":"MIN(15,COUNTIF(K22:AE22,\">=1\"))","v":0},{"$f":"IF(I22>=15,(SUM(LARGE(K22:AE22,{1;2;3;4;5;6;7;8;9;10;11;12;13;14;15}))+AF22),SUM(K22:AF22))","v":0},null,null,null,null,null,null,null,null,null,null,null,null,null,null,null,null,null,null,null,null,null,null,{"$f":"COUNTIF(K22:AF22,\">=1\")-I22","v":0}]
["W",{"$f":"IF(ISBLANK(E23),\"\",LOOKUP(IF(2000+E23>$G$1,1900+E23,2000+E23),Tabelle2!A:A,Tabelle2!C:C))","v":30},{"$f":"IF(G23>=1,SUMPRODUCT(($A$6:$A$418=A23)*($B$6:$B$418=B23)*($G$6:$G$418>G23))+1,\"\")","v":1},"Bernstein, Tessa",93,"Bad Dürrenberg",{"$f":"H23+J23","v":21},{"$f":"COUNTIF(K23:AE23,\">=1\")+COUNTIF(K23:AE23,\"T\")","v":1},{"$f":"MIN(15,COUNTIF(K23:AE23,\">=1\"))","v":1},{"$f":"IF(I23>=15,(SUM(LARGE(K23:AE23,{1;2;3;4;5;6;7;8;9;10;11;12;13;14;15}))+AF23),SUM(K23:AF23))","v":20},20,null,null,null,null,null,null,null,null,null,null,null,null,null,null,null,null,null,null,null,null,null,{"$f":"COUNTIF(K23:AF23,\">=1\")-I23","v":0}]
["W",{"$f":"IF(ISBLANK(E24),\"\",LOOKUP(IF(2000+E24>$G$1,1900+E24,2000+E24),Tabelle2!A:A,Tabelle2!C:C))","v":30},{"$f":"IF(G24>=1,SUMPRODUCT(($A$6:$A$418=A24)*($B$6:$B$418=B24)*($G$6:$G$418>G24))+1,\"\")","v":""},"Geck, Jessy",92,"Merseburg",{"$f":"H24+J24","v":0},{"$f":"COUNTIF(K24:AE24,\">=1\")+COUNTIF(K24:AE24,\"T\")","v":0},{"$f":"MIN(15,COUNTIF(K24:AE24,\">=1\"))","v":0},{"$f":"IF(I24>=15,(SUM(LARGE(K24:AE24,{1;2;3;4;5;6;7;8;9;10;11;12;13;14;15}))+AF24),SUM(K24:AF24))","v":0},null,null,null,null,null,null,null,null,null,null,null,null,null,null,null,null,null,null,null,null,null,null,{"$f":"COUNTIF(K24:AF24,\">=1\")-I24","v":0}]
["W",{"$f":"IF(ISBLANK(E25),\"\",LOOKUP(IF(2000+E25>$G$1,1900+E25,2000+E25),Tabelle2!A:A,Tabelle2!C:C))","v":30},{"$f":"IF(G25>=1,SUMPRODUCT(($A$6:$A$418=A25)*($B$6:$B$418=B25)*($G$6:$G$418>G25))+1,\"\")","v":""},"Giewolles, Juliane",89,"Frankleben",{"$f":"H25+J25","v":0},{"$f":"COUNTIF(K25:AE25,\">=1\")+COUNTIF(K25:AE25,\"T\")","v":0},{"$f":"MIN(15,COUNTIF(K25:AE25,\">=1\"))","v":0},{"$f":"IF(I25>=15,(SUM(LARGE(K25:AE25,{1;2;3;4;5;6;7;8;9;10;11;12;13;14;15}))+AF25),SUM(K25:AF25))","v":0},null,null,null,null,null,null,null,null,null,null,null,null,null,null,null,null,null,null,null,null,null,null,{"$f":"COUNTIF(K25:AF25,\">=1\")-I25","v":0}]
["W",{"$f":"IF(ISBLANK(E26),\"\",LOOKUP(IF(2000+E26>$G$1,1900+E26,2000+E26),Tabelle2!A:A,Tabelle2!C:C))","v":30},{"$f":"IF(G26>=1,SUMPRODUCT(($A$6:$A$418=A26)*($B$6:$B$418=B26)*($G$6:$G$418>G26))+1,\"\")","v":""},"Hippe, Juliane",89,"Merseburg",{"$f":"H26+J26","v":0},{"$f":"COUNTIF(K26:AE26,\">=1\")+COUNTIF(K26:AE26,\"T\")","v":0},{"$f":"MIN(15,COUNTIF(K26:AE26,\">=1\"))","v":0},{"$f":"IF(I26>=15,(SUM(LARGE(K26:AE26,{1;2;3;4;5;6;7;8;9;10;11;12;13;14;15}))+AF26),SUM(K26:AF26))","v":0},null,null,null,null,null,null,null,null,null,null,null,null,null,null,null,null,null,null,null,null,null,null,{"$f":"COUNTIF(K26:AF26,\">=1\")-I26","v":0}]
["W",{"$f":"IF(ISBLANK(E27),\"\",LOOKUP(IF(2000+E27>$G$1,1900+E27,2000+E27),Tabelle2!A:A,Tabelle2!C:C))","v":30},{"$f":"IF(G27>=1,SUMPRODUCT(($A$6:$A$418=A27)*($B$6:$B$418=B27)*($G$6:$G$418>G27))+1,\"\")","v":""},"Josch, Janet",89,"Bad Lauchstädt",{"$f":"H27+J27","v":0},{"$f":"COUNTIF(K27:AE27,\">=1\")+COUNTIF(K27:AE27,\"T\")","v":0},{"$f":"MIN(15,COUNTIF(K27:AE27,\">=1\"))","v":0},{"$f":"IF(I27>=15,(SUM(LARGE(K27:AE27,{1;2;3;4;5;6;7;8;9;10;11;12;13;14;15}))+AF27),SUM(K27:AF27))","v":0},null,null,null,null,null,null,null,null,null,null,null,null,null,null,null,null,null,null,null,null,null,null,{"$f":"COUNTIF(K27:AF27,\">=1\")-I27","v":0}]
["W",{"$f":"IF(ISBLANK(E28),\"\",LOOKUP(IF(2000+E28>$G$1,1900+E28,2000+E28),Tabelle2!A:A,Tabelle2!C:C))","v":35},{"$f":"IF(G28>=1,SUMPRODUCT(($A$6:$A$418=A28)*($B$6:$B$418=B28)*($G$6:$G$418>G28))+1,\"\")","v":1},"Bergner, Elena",84,"TSV Leuna Ski",{"$f":"H28+J28","v":21},{"$f":"COUNTIF(K28:AE28,\">=1\")+COUNTIF(K28:AE28,\"T\")","v":1},{"$f":"MIN(15,COUNTIF(K28:AE28,\">=1\"))","v":1},{"$f":"IF(I28>=15,(SUM(LARGE(K28:AE28,{1;2;3;4;5;6;7;8;9;10;11;12;13;14;15}))+AF28),SUM(K28:AF28))","v":20},null,20,null,null,null,null,null,null,null,null,null,null,null,null,null,null,null,null,null,null,null,null,{"$f":"COUNTIF(K28:AF28,\">=1\")-I28","v":0}]
["W",{"$f":"IF(ISBLANK(E29),\"\",LOOKUP(IF(2000+E29>$G$1,1900+E29,2000+E29),Tabelle2!A:A,Tabelle2!C:C))","v":35},{"$f":"IF(G29>=1,SUMPRODUCT(($A$6:$A$418=A29)*($B$6:$B$418=B29)*($G$6:$G$418>G29))+1,\"\")","v":2},"Heimann, Steffi",86,"SV Braunsbedra",{"$f":"H29+J29","v":16},{"$f":"COUNTIF(K29:AE29,\">=1\")+COUNTIF(K29:AE29,\"T\")","v":1},{"$f":"MIN(15,COUNTIF(K29:AE29,\">=1\"))","v":1},{"$f":"IF(I29>=15,(SUM(LARGE(K29:AE29,{1;2;3;4;5;6;7;8;9;10;11;12;13;14;15}))+AF29),SUM(K29:AF29))","v":15},15,null,null,null,null,null,null,null,null,null,null,null,null,null,null,null,null,null,null,null,null,null,{"$f":"COUNTIF(K29:AF29,\">=1\")-I29","v":0}]
["W",{"$f":"IF(ISBLANK(E30),\"\",LOOKUP(IF(2000+E30>$G$1,1900+E30,2000+E30),Tabelle2!A:A,Tabelle2!C:C))","v":35},{"$f":"IF(G30>=1,SUMPRODUCT(($A$6:$A$418=A30)*($B$6:$B$418=B30)*($G$6:$G$418>G30))+1,\"\")","v":""},"Engel, Franka",85,"SV Braunsbedra",{"$f":"H30+J30","v":0},{"$f":"COUNTIF(K30:AE30,\">=1\")+COUNTIF(K30:AE30,\"T\")","v":0},{"$f":"MIN(15,COUNTIF(K30:AE30,\">=1\"))","v":0},{"$f":"IF(I30>=15,(SUM(LARGE(K30:AE30,{1;2;3;4;5;6;7;8;9;10;11;12;13;14;15}))+AF30),SUM(K30:AF30))","v":0},null,null,null,null,null,null,null,null,null,null,null,null,null,null,null,null,null,null,null,null,null,null,{"$f":"COUNTIF(K30:AF30,\">=1\")-I30","v":0}]
["W",{"$f":"IF(ISBLANK(E31),\"\",LOOKUP(IF(2000+E31>$G$1,1900+E31,2000+E31),Tabelle2!A:A,Tabelle2!C:C))","v":35},{"$f":"IF(G31>=1,SUMPRODUCT(($A$6:$A$418=A31)*($B$6:$B$418=B31)*($G$6:$G$418>G31))+1,\"\")","v":""},"Haring, Anika",86,"Kinderträume Merseburg",{"$f":"H31+J31","v":0},{"$f":"COUNTIF(K31:AE31,\">=1\")+COUNTIF(K31:AE31,\"T\")","v":0},{"$f":"MIN(15,COUNTIF(K31:AE31,\">=1\"))","v":0},{"$f":"IF(I31>=15,(SUM(LARGE(K31:AE31,{1;2;3;4;5;6;7;8;9;10;11;12;13;14;15}))+AF31),SUM(K31:AF31))","v":0},null,null,null,null,null,null,null,null,null,null,null,null,null,null,null,null,null,null,null,null,null,null,{"$f":"COUNTIF(K31:AF31,\">=1\")-I31","v":0}]
["W",{"$f":"IF(ISBLANK(E32),\"\",LOOKUP(IF(2000+E32>$G$1,1900+E32,2000+E32),Tabelle2!A:A,Tabelle2!C:C))","v":35},{"$f":"IF(G32>=1,SUMPRODUCT(($A$6:$A$418=A32)*($B$6:$B$418=B32)*($G$6:$G$418>G32))+1,\"\")","v":""},"Müller, Antje",87,"Roßbach",{"$f":"H32+J32","v":0},{"$f":"COUNTIF(K32:AE32,\">=1\")+COUNTIF(K32:AE32,\"T\")","v":0},{"$f":"MIN(15,COUNTIF(K32:AE32,\">=1\"))","v":0},{"$f":"IF(I32>=15,(SUM(LARGE(K32:AE32,{1;2;3;4;5;6;7;8;9;10;11;12;13;14;15}))+AF32),SUM(K32:AF32))","v":0},null,null,null,null,null,null,null,null,null,null,null,null,null,null,null,null,null,null,null,null,null,null,{"$f":"COUNTIF(K32:AF32,\">=1\")-I32","v":0}]
["W",{"$f":"IF(ISBLANK(E33),\"\",LOOKUP(IF(2000+E33>$G$1,1900+E33,2000+E33),Tabelle2!A:A,Tabelle2!C:C))","v":35},{"$f":"IF(G33>=1,SUMPRODUCT(($A$6:$A$418=A33)*($B$6:$B$418=B33)*($G$6:$G$418>G33))+1,\"\")","v":""},"Vogler, Stefanie",85,"Gröst",{"$f":"H33+J33","v":0},{"$f":"COUNTIF(K33:AE33,\">=1\")+COUNTIF(K33:AE33,\"T\")","v":0},{"$f":"MIN(15,COUNTIF(K33:AE33,\">=1\"))","v":0},{"$f":"IF(I33>=15,(SUM(LARGE(K33:AE33,{1;2;3;4;5;6;7;8;9;10;11;12;13;14;15}))+AF33),SUM(K33:AF33))","v":0},null,null,null,null,null,null,null,null,null,null,null,null,null,null,null,null,null,null,null,null,null,null,{"$f":"COUNTIF(K33:AF33,\">=1\")-I33","v":0}]
["W",{"$f":"IF(ISBLANK(E34),\"\",LOOKUP(IF(2000+E34>$G$1,1900+E34,2000+E34),Tabelle2!A:A,Tabelle2!C:C))","v":35},{"$f":"IF(G34>=1,SUMPRODUCT(($A$6:$A$418=A34)*($B$6:$B$418=B34)*($G$6:$G$418>G34))+1,\"\")","v":""},"Vorrath, Nancy",86,"TSV Leuna Ski",{"$f":"H34+J34","v":0},{"$f":"COUNTIF(K34:AE34,\">=1\")+COUNTIF(K34:AE34,\"T\")","v":0},{"$f":"MIN(15,COUNTIF(K34:AE34,\">=1\"))","v":0},{"$f":"IF(I34>=15,(SUM(LARGE(K34:AE34,{1;2;3;4;5;6;7;8;9;10;11;12;13;14;15}))+AF34),SUM(K34:AF34))","v":0},null,null,null,null,null,null,null,null,null,null,null,null,null,null,null,null,null,null,null,null,null,null,{"$f":"COUNTIF(K34:AF34,\">=1\")-I34","v":0}]
["W",{"$f":"IF(ISBLANK(E35),\"\",LOOKUP(IF(2000+E35>$G$1,1900+E35,2000+E35),Tabelle2!A:A,Tabelle2!C:C))","v":35},{"$f":"IF(G35>=1,SUMPRODUCT(($A$6:$A$418=A35)*($B$6:$B$418=B35)*($G$6:$G$418>G35))+1,\"\")","v":""},"Weber, Anne",88,"Barnstädt",{"$f":"H35+J35","v":0},{"$f":"COUNTIF(K35:AE35,\">=1\")+COUNTIF(K35:AE35,\"T\")","v":0},{"$f":"MIN(15,COUNTIF(K35:AE35,\">=1\"))","v":0},{"$f":"IF(I35>=15,(SUM(LARGE(K35:AE35,{1;2;3;4;5;6;7;8;9;10;11;12;13;14;15}))+AF35),SUM(K35:AF35))","v":0},null,null,null,null,null,null,null,null,null,null,null,null,null,null,null,null,null,null,null,null,null,null,{"$f":"COUNTIF(K35:AF35,\">=1\")-I35","v":0}]
["W",{"$f":"IF(ISBLANK(E36),\"\",LOOKUP(IF(2000+E36>$G$1,1900+E36,2000+E36),Tabelle2!A:A,Tabelle2!C:C))","v":40},{"$f":"IF(G36>=1,SUMPRODUCT(($A$6:$A$418=A36)*($B$6:$B$418=B36)*($G$6:$G$418>G36))+1,\"\")","v":1},"Köller, Susan",83,"TC Merseburg",{"$f":"H36+J36","v":42},{"$f":"COUNTIF(K36:AE36,\">=1\")+COUNTIF(K36:AE36,\"T\")","v":2},{"$f":"MIN(15,COUNTIF(K36:AE36,\">=1\"))","v":2},{"$f":"IF(I36>=15,(SUM(LARGE(K36:AE36,{1;2;3;4;5;6;7;8;9;10;11;12;13;14;15}))+AF36),SUM(K36:AF36))","v":40},20,20,null,null,null,null,null,null,null,null,null,null,null,null,null,null,null,null,null,null,null,null,{"$f":"COUNTIF(K36:AF36,\">=1\")-I36","v":0}]
["W",{"$f":"IF(ISBLANK(E37),\"\",LOOKUP(IF(2000+E37>$G$1,1900+E37,2000+E37),Tabelle2!A:A,Tabelle2!C:C))","v":40},{"$f":"IF(G37>=1,SUMPRODUCT(($A$6:$A$418=A37)*($B$6:$B$418=B37)*($G$6:$G$418>G37))+1,\"\")","v":2},"Block, Anett",79,"SV Braunsbedra",{"$f":"H37+J37","v":38},{"$f":"COUNTIF(K37:AE37,\">=1\")+COUNTIF(K37:AE37,\"T\")","v":2},{"$f":"MIN(15,COUNTIF(K37:AE37,\">=1\"))","v":2},{"$f":"IF(I37>=15,(SUM(LARGE(K37:AE37,{1;2;3;4;5;6;7;8;9;10;11;12;13;14;15}))+AF37),SUM(K37:AF37))","v":36},18,18,null,null,null,null,null,null,null,null,null,null,null,null,null,null,null,null,null,null,null,null,{"$f":"COUNTIF(K37:AF37,\">=1\")-I37","v":0}]
["W",{"$f":"IF(ISBLANK(E38),\"\",LOOKUP(IF(2000+E38>$G$1,1900+E38,2000+E38),Tabelle2!A:A,Tabelle2!C:C))","v":40},{"$f":"IF(G38>=1,SUMPRODUCT(($A$6:$A$418=A38)*($B$6:$B$418=B38)*($G$6:$G$418>G38))+1,\"\")","v":""},"Bischof, Katrin",81,"SV Braunsbedra",{"$f":"H38+J38","v":0},{"$f":"COUNTIF(K38:AE38,\">=1\")+COUNTIF(K38:AE38,\"T\")","v":0},{"$f":"MIN(15,COUNTIF(K38:AE38,\">=1\"))","v":0},{"$f":"IF(I38>=15,(SUM(LARGE(K38:AE38,{1;2;3;4;5;6;7;8;9;10;11;12;13;14;15}))+AF38),SUM(K38:AF38))","v":0},null,null,null,null,null,null,null,null,null,null,null,null,null,null,null,null,null,null,null,null,null,null,{"$f":"COUNTIF(K38:AF38,\">=1\")-I38","v":0}]
["W",{"$f":"IF(ISBLANK(E39),\"\",LOOKUP(IF(2000+E39>$G$1,1900+E39,2000+E39),Tabelle2!A:A,Tabelle2!C:C))","v":40},{"$f":"IF(G39>=1,SUMPRODUCT(($A$6:$A$418=A39)*($B$6:$B$418=B39)*($G$6:$G$418>G39))+1,\"\")","v":""},"Buttstädt, Nicole",83,"Braunsbedra",{"$f":"H39+J39","v":0},{"$f":"COUNTIF(K39:AE39,\">=1\")+COUNTIF(K39:AE39,\"T\")","v":0},{"$f":"MIN(15,COUNTIF(K39:AE39,\">=1\"))","v":0},{"$f":"IF(I39>=15,(SUM(LARGE(K39:AE39,{1;2;3;4;5;6;7;8;9;10;11;12;13;14;15}))+AF39),SUM(K39:AF39))","v":0},null,null,null,null,null,null,null,null,null,null,null,null,null,null,null,null,null,null,null,null,null,null,{"$f":"COUNTIF(K39:AF39,\">=1\")-I39","v":0}]
["W",{"$f":"IF(ISBLANK(E40),\"\",LOOKUP(IF(2000+E40>$G$1,1900+E40,2000+E40),Tabelle2!A:A,Tabelle2!C:C))","v":40},{"$f":"IF(G40>=1,SUMPRODUCT(($A$6:$A$418=A40)*($B$6:$B$418=B40)*($G$6:$G$418>G40))+1,\"\")","v":""},"Grabowski, Carolin",82,"Roßbach",{"$f":"H40+J40","v":0},{"$f":"COUNTIF(K40:AE40,\">=1\")+COUNTIF(K40:AE40,\"T\")","v":0},{"$f":"MIN(15,COUNTIF(K40:AE40,\">=1\"))","v":0},{"$f":"IF(I40>=15,(SUM(LARGE(K40:AE40,{1;2;3;4;5;6;7;8;9;10;11;12;13;14;15}))+AF40),SUM(K40:AF40))","v":0},null,null,null,null,null,null,null,null,null,null,null,null,null,null,null,null,null,null,null,null,null,null,{"$f":"COUNTIF(K40:AF40,\">=1\")-I40","v":0}]
{"$rows_left_out":191}
{"sheet":"Tabelle2","index":1,"n_rows":123,"n_cols":3,"rows_kept":123,"cut":false,"hidden":true,"merged":[]}
["AK_Liste",null,2023]
["Geb.-Jahr","Alter","A-Kl."]
[1930,{"$f":"Tabelle1!$G$1-Tabelle2!A3","v":93},90]
[1931,{"$f":"Tabelle1!$G$1-Tabelle2!A4","v":92},90]
[1932,{"$f":"Tabelle1!$G$1-Tabelle2!A5","v":91},90]
[1933,{"$f":"Tabelle1!$G$1-Tabelle2!A6","v":90},90]
[1934,{"$f":"Tabelle1!$G$1-Tabelle2!A7","v":89},85]
[1935,{"$f":"Tabelle1!$G$1-Tabelle2!A8","v":88},85]
[1936,{"$f":"Tabelle1!$G$1-Tabelle2!A9","v":87},85]
[1937,{"$f":"Tabelle1!$G$1-Tabelle2!A10","v":86},85]
[1938,{"$f":"Tabelle1!$G$1-Tabelle2!A11","v":85},85]
[1939,{"$f":"Tabelle1!$G$1-Tabelle2!A12","v":84},80]
[1940,{"$f":"Tabelle1!$G$1-Tabelle2!A13","v":83},80]
[1941,{"$f":"Tabelle1!$G$1-Tabelle2!A14","v":82},80]
[1942,{"$f":"Tabelle1!$G$1-Tabelle2!A15","v":81},80]
[1943,{"$f":"Tabelle1!$G$1-Tabelle2!A16","v":80},80]
[1944,{"$f":"Tabelle1!$G$1-Tabelle2!A17","v":79},75]
[1945,{"$f":"Tabelle1!$G$1-Tabelle2!A18","v":78},75]
[1946,{"$f":"Tabelle1!$G$1-Tabelle2!A19","v":77},75]
[1947,{"$f":"Tabelle1!$G$1-Tabelle2!A20","v":76},75]
[1948,{"$f":"Tabelle1!$G$1-Tabelle2!A21","v":75},75]
[1949,{"$f":"Tabelle1!$G$1-Tabelle2!A22","v":74},70]
[1950,{"$f":"Tabelle1!$G$1-Tabelle2!A23","v":73},70]
[1951,{"$f":"Tabelle1!$G$1-Tabelle2!A24","v":72},70]
[1952,{"$f":"Tabelle1!$G$1-Tabelle2!A25","v":71},70]
[1953,{"$f":"Tabelle1!$G$1-Tabelle2!A26","v":70},70]
[1954,{"$f":"Tabelle1!$G$1-Tabelle2!A27","v":69},65]
[1955,{"$f":"Tabelle1!$G$1-Tabelle2!A28","v":68},65]
[1956,{"$f":"Tabelle1!$G$1-Tabelle2!A29","v":67},65]
[1957,{"$f":"Tabelle1!$G$1-Tabelle2!A30","v":66},65]
[1958,{"$f":"Tabelle1!$G$1-Tabelle2!A31","v":65},65]
[1959,{"$f":"Tabelle1!$G$1-Tabelle2!A32","v":64},60]
[1960,{"$f":"Tabelle1!$G$1-Tabelle2!A33","v":63},60]
[1961,{"$f":"Tabelle1!$G$1-Tabelle2!A34","v":62},60]
[1962,{"$f":"Tabelle1!$G$1-Tabelle2!A35","v":61},60]
[1963,{"$f":"Tabelle1!$G$1-Tabelle2!A36","v":60},60]
[1964,{"$f":"Tabelle1!$G$1-Tabelle2!A37","v":59},55]
[1965,{"$f":"Tabelle1!$G$1-Tabelle2!A38","v":58},55]
[1966,{"$f":"Tabelle1!$G$1-Tabelle2!A39","v":57},55]
[1967,{"$f":"Tabelle1!$G$1-Tabelle2!A40","v":56},55]
{"$rows_left_out":83}